{"text_format":"1","workbook":"xlsx","n_sheets":13,"sheets":["NEW Enrollment Form","refs and calcs","MUGS template","CAT template","eServices Template template old","eServices Template template new","Medical Waivers","Tools","Supp_Life_STD_LTD_Info","Enrollment Form Explanations","PlanSource MUW Export","Counts_Relation_Tier_Ancillary","Utilization"],"not_rendered":{"charts":0,"images":22,"macros":1,"external_links":2,"defined_names":168,"comments":4,"pivot_tables":0},"unopened":[],"bounds":{"document_bytes":16777216,"sheet_cells":100000,"rows_first":2000,"rows_last":500,"rows_between":2000,"halvings":0,"cell_chars":16384,"cell_head_chars":4096},"cells_cut":0,"cells_raw":0,"read":"whole","date_system":"1900"}

{"sheet":"NEW Enrollment Form","index":0,"n_rows":6,"n_cols":76,"rows_kept":6,"cut":false,"hidden":false,"merged":[[1,1,1,74],[4,8,4,9],[3,8,3,11]]}
[]
["NEW BUSINESS ENROLLMENT SPREADSHEET                                       NEW BUSINESS ENROLLMENT SPREADSHEET                                        NEW BUSINESS ENROLLMENT SPREADSHEET                                        NEW BUSINESS ENROLLMENT SPREADSHEET                                         NEW BUSINESS ENROLLMENT SPREADSHEET                                        NEW BUSINESS ENROLLMENT SPREADSHEET                                        NEW BUSINESS ENROLLMENT SPREADSHEET                                        NEW BUSINESS ENROLLMENT SPREADSHEET                                        NEW BUSINESS ENROLLMENT SPREADSHEET                                        NEW BUSINESS ENROLLMENT SPREADSHEET                                        NEW BUSINESS ENROLLMENT SPREADSHEET                                       NEW BUSINESS ENROLLMENT SPREADSHEET","NEW BUSINESS ENROLLMENT SPREADSHEET                                           NEW BUSINESS ENROLLMENT SPREADSHEET                                                              NEW BUSINESS ENROLLMENT SPREADSHEET                                                              NEW BUSINESS ENROLLMENT SPREADSHEET                                                                          NEW BUSINESS ENROLLMENT SPREADSHEET                                                     NEW BUSINESS ENROLLMENT SPREADSHEET                                                    NEW BUSINESS ENROLLMENT SPREADSHEET                                                  NEW BUSINESS ENROLLMENT SPREADSHEET                                                 NEW BUSINESS ENROLLMENT SPREADSHEET                                                 NEW BUSINESS ENROLLMENT SPREADSHEET"]
["* Required Fields for all Subscribers & Dependents ",null,null,null,null,null,null,null,null,null,null,null,null,"A. Employee (Subscriber) Information",null,null,null,null,null,null,null,"B. Employer Section",null,null,null,null,"C. Product Selection",null,null,null,null,null,null,null,null,null,null,null,null,null,null,null,null,null,null,null,null,null,null,null,"D. Other Medical Info",null,null,null,null,null,null,null,"E. Medicare Information",null,null,null,null,"       F. UHC Internal Only - FACETS INFO - Heritage/RV/NHP",null,null,null,null,null,null,null,"G. UHC - Internal Use Only."]
[null,null,null,null,null,null,null,null,"Underwriting ONLY (2-50 Grandfathered or 51+)",null,null,null,null,null,null,null,null,null,null,null,null,null,null,null,null,null,null,null,null,null,null,null,null,"Life coverage amounts exceeding the guarantee issue will not be installed until proof of good health is provided and approved.   Completion of a Group Life and Disability Employee Enrollment form is required if Life exceeds guarantee issue amount."]
[null,null,null,null,null,null,null,null,"Height"]
["* Employee ID/SSN","* Dependent ID/SSN","* Relationship","* Last Name","* First Name","Middle Initial","* Sex","* Date of Birth\n(MM/DD/YYYY)","Feet","Inches","Weight","Tobacco","Twin?","Street Address","City","State","ZIP","Home Phone","Work Phone (Optional)","Employee Email Address","Tier\n(Optional)\nTotals in Next Tab","Hire Date\n(MM/DD/YY)","Coverage Effective Date\n(MM/DD/YY)","COBRA Begin Date\n(MM/DD/YY)","COBRA End Date\n(MM/DD/YY)","Retire Date (51+ only)\n(MM/DD/YY)","Medical Coverage","Medical Plan\n(Multi-Choice Only)","PCP\n(HMO Only)","Dental Coverage","Dental Plan\n(Dual Option Only)","PCD\n(DHMO Only)","Vision Coverage","PRIME Life Coverage","PRIME Life Coverage Amount","Employee Annual Salary","PRIME Life Occupational Class","AD&D Amount","Dependent Life","Hours Worked","Supplemental Life / STD / LTD OC Class","EE Supplemental Life Plan","EE Supplemental Life Amount","Grandfathered EE Supp. Life Amount","SP Supplemental Life Amount","CH Supplemental Life Amount","STD (Salary) Coverage","STD\nBuyup?","LTD (Salary) Coverage","LTD\nBuyup?","* COB - Other Medical ","COB (begin date)\n(MM/DD/YY)","COB (end date)\n(MM/DD/YY)","AO Coverage?","Eligibility Reason","Ineligibility Reason","Primary coverage Code","Part A Start Date","Part A End Date","Part B Start Date","Part B End Date","Part D Start Date","Part D End Date","RV Super Group","RV Class ID","RV Sub Group (Billing)","RV Med Network Code","RV Med Product","NHP Group Number","On Prior Carrier? ","Optum Bank HSA Application","Medical Waiver Reason","Health Transfer\n(Completed by C.I.)","Covered","Policy Number","Member HBX ID"]

{"sheet":"refs and calcs","index":1,"n_rows":68,"n_cols":15,"rows_kept":68,"cut":false,"hidden":true,"merged":[]}
["none","none","none",{"$f":"Supp_Life_STD_LTD_Info!B5","v":1},{"$f":"Supp_Life_STD_LTD_Info!C5","v":0},{"$f":"Supp_Life_STD_LTD_Info!D5","v":0},{"$f":"Supp_Life_STD_LTD_Info!E5","v":0},{"$f":"Supp_Life_STD_LTD_Info!F5","v":0},{"$f":"Supp_Life_STD_LTD_Info!G5","v":0},{"$f":"Supp_Life_STD_LTD_Info!H5","v":0},{"$f":"Supp_Life_STD_LTD_Info!I5","v":0},"$10k",null,"\"environment\" variables","variable value"]
["$10k","$5k",null,{"$f":"Supp_Life_STD_LTD_Info!B6","v":2},{"$f":"Supp_Life_STD_LTD_Info!C6","v":0},{"$f":"Supp_Life_STD_LTD_Info!D6","v":0},{"$f":"Supp_Life_STD_LTD_Info!E6","v":0},{"$f":"Supp_Life_STD_LTD_Info!F6","v":0},{"$f":"Supp_Life_STD_LTD_Info!G6","v":0},{"$f":"Supp_Life_STD_LTD_Info!H6","v":0},{"$f":"Supp_Life_STD_LTD_Info!I6","v":0},"$20k",null,"Check_Plan_Medical"]
["$20k","$10k",null,{"$f":"Supp_Life_STD_LTD_Info!B7","v":3},{"$f":"Supp_Life_STD_LTD_Info!C7","v":0},{"$f":"Supp_Life_STD_LTD_Info!D7","v":0},{"$f":"Supp_Life_STD_LTD_Info!E7","v":0},{"$f":"Supp_Life_STD_LTD_Info!F7","v":0},{"$f":"Supp_Life_STD_LTD_Info!G7","v":0},{"$f":"Supp_Life_STD_LTD_Info!H7","v":0},{"$f":"Supp_Life_STD_LTD_Info!I7","v":0},"$30k",null,"Check_Coverage_Medical"]
["$30k","$15k",null,{"$f":"Supp_Life_STD_LTD_Info!B8","v":4},{"$f":"Supp_Life_STD_LTD_Info!C8","v":0},{"$f":"Supp_Life_STD_LTD_Info!D8","v":0},{"$f":"Supp_Life_STD_LTD_Info!E8","v":0},{"$f":"Supp_Life_STD_LTD_Info!F8","v":0},{"$f":"Supp_Life_STD_LTD_Info!G8","v":0},{"$f":"Supp_Life_STD_LTD_Info!H8","v":0},{"$f":"Supp_Life_STD_LTD_Info!I8","v":0},"$40k",null,"Check_Coverage_Dental"]
[null,null,null,{"$f":"Supp_Life_STD_LTD_Info!B9","v":5},{"$f":"Supp_Life_STD_LTD_Info!C9","v":0},{"$f":"Supp_Life_STD_LTD_Info!D9","v":0},{"$f":"Supp_Life_STD_LTD_Info!E9","v":0},{"$f":"Supp_Life_STD_LTD_Info!F9","v":0},{"$f":"Supp_Life_STD_LTD_Info!G9","v":0},{"$f":"Supp_Life_STD_LTD_Info!H9","v":0},{"$f":"Supp_Life_STD_LTD_Info!I9","v":0},"$50k",null,"Check_Plan_Dental"]
["Y",null,null,{"$f":"Supp_Life_STD_LTD_Info!B10","v":6},{"$f":"Supp_Life_STD_LTD_Info!C10","v":0},{"$f":"Supp_Life_STD_LTD_Info!D10","v":0},{"$f":"Supp_Life_STD_LTD_Info!E10","v":0},{"$f":"Supp_Life_STD_LTD_Info!F10","v":0},{"$f":"Supp_Life_STD_LTD_Info!G10","v":0},{"$f":"Supp_Life_STD_LTD_Info!H10","v":0},{"$f":"Supp_Life_STD_LTD_Info!I10","v":0},"$60k",null,"Check_Coverage_Vision"]
["N",null,null,{"$f":"Supp_Life_STD_LTD_Info!B11","v":7},{"$f":"Supp_Life_STD_LTD_Info!C11","v":0},{"$f":"Supp_Life_STD_LTD_Info!D11","v":0},{"$f":"Supp_Life_STD_LTD_Info!E11","v":0},{"$f":"Supp_Life_STD_LTD_Info!F11","v":0},{"$f":"Supp_Life_STD_LTD_Info!G11","v":0},{"$f":"Supp_Life_STD_LTD_Info!H11","v":0},{"$f":"Supp_Life_STD_LTD_Info!I11","v":0},"$70k","AA","Check_Coverage_DepLife"]
[null,null,null,null,null,null,null,null,null,null,null,"$80k","AE","Check_Coverage_PrimeLife"]
[{"$f":"IF(A10=\"\",\"\",\"none\")","v":""},null,null,0,null,"N",null,null,null,null,null,"$90k","AK","Check_Salary"]
[{"$f":"IF(Supp_Life_STD_LTD_Info!C5=\"\",\"\",Supp_Life_STD_LTD_Info!C5)","v":""},null,null,1,null,"Y",null,null,null,null,null,"$100k","AL","Check_PrimeOccClass"]
[{"$f":"IF(A12=\"\",\"\",\"none\")","v":""},null,null,2,null,"U",null,null,null,null,null,"$110k","AP","Check_SuppLife"]
[{"$f":"IF(Supp_Life_STD_LTD_Info!C6=\"\",\"\",Supp_Life_STD_LTD_Info!C6)","v":""},null,null,3,null,null,null,null,null,null,null,"$120k","AR","Check_STD"]
[{"$f":"IF(A14=\"\",\"\",\"none\")","v":""},null,null,4,null,"EE",null,null,null,null,null,"$130k","AS","Check_LTD"]
[{"$f":"IF(Supp_Life_STD_LTD_Info!C7=\"\",\"\",Supp_Life_STD_LTD_Info!C7)","v":""},null,null,5,null,"SP",null,null,null,null,null,"$140k","AZ","EffectiveDate"]
[{"$f":"IF(A16=\"\",\"\",\"none\")","v":""},null,null,6,null,"CH",null,null,null,null,null,"$150k","CA","Check_HT"]
{"$rows_left_out":54}
{"sheet":"MUGS template","index":2,"n_rows":1,"n_cols":10,"rows_kept":1,"cut":false,"hidden":true,"merged":[]}
["EEID*","* Last Name","* First Name","* Date of Birth (MM/DD/YYYY)","* Sex","ContractTier*","* Relationship","Feet","Inches","Weight"]

{"sheet":"CAT template","index":3,"n_rows":1,"n_cols":8,"rows_kept":1,"cut":false,"hidden":true,"merged":[]}
["EEID","SSN","Last Name","First Name","Sex","Date of Birth (MM/DD/YYYY)","ZipCode","Relationship"]

{"sheet":"eServices Template template old","index":4,"n_rows":4,"n_cols":20,"rows_kept":4,"cut":false,"hidden":true,"merged":[[2,16,3,16],[2,17,3,17],[2,19,3,19],[2,1,2,2],[2,3,3,3],[2,4,2,8],[2,9,2,13],[2,14,3,14],[2,15,3,15]]}
[]
[null,"* Required Field"]
[null,"EMPLOYEE NAME",null,"SEX*","EMPLOYEE *\n(Enter Age OR DOB)\nDOB can be entered as one column or as individual columns. Refer to the instructional tab for information regarding acceptable formats.",null,null,null,null,"SPOUSE\n(Enter Age OR DOB)\nDOB can be entered as one column or as individual columns. Refer to the instructional tab for information regarding acceptable formats.",null,null,null,null,"NO. \nCHILD\nENR*","EMPLOYMENT STATUS*","ANNUAL SALARY","OUT OF          AREA               OOA information will be ignored for Multi-site groups.","COMPANY            LOCATION ZIP CODE* Location information will be ignored for Single-site groups.","CLASS TYPE"]
[null,"FIRST*","LAST*",null,"AGE","DOB\n(MM/DD/YYYY)","MM","DD","YY","SPOUSE \nAGE","DOB\n(MM/DD/YYYY)","MM","DD","YY",null,null,null,null,"ZIP CODE                           (5-Digits)"]

{"sheet":"eServices Template template new","index":5,"n_rows":4,"n_cols":45,"rows_kept":4,"cut":false,"hidden":true,"merged":[[2,42,2,44],[2,2,2,11],[2,12,2,14],[2,15,2,17],[2,18,2,20],[2,21,2,23],[2,24,2,26],[2,27,2,29],[2,30,2,32],[2,33,2,35],[2,36,2,38],[2,39,2,41]]}
[]
[null,null,"* Required Field"]
[null,"COMPANY            LOCATION ZIP CODE Location information will be ignored for Single-site groups.","EMPLOYEE DETAILS",null,null,null,null,null,null,null,null,null,"SPOUSE\nEnter Age OR DOB only if Spouse is being enrolled, if not, leave it blank.",null,null,"CHILD 1\nEnter Age OR DOB only if a child is being enrolled, if not, leave it blank.",null,null,"CHILD 2 \nEnter Age OR DOB only if a child is being enrolled, if not, leave it blank.",null,null,"CHILD 3\nEnter Age OR DOB only if a child is being enrolled, if not, leave it blank.",null,null,"CHILD 4\nEnter Age OR DOB only if a child is being enrolled, if not, leave it blank.",null,null,"CHILD 5\nEnter Age OR DOB only if a child is being enrolled, if not, leave it blank.",null,null,"CHILD 6\nEnter Age OR DOB only if a child is being enrolled, if not, leave it blank.",null,null,"CHILD 7\nEnter Age OR DOB only if a child is being enrolled, if not, leave it blank.",null,null,"CHILD 8\nEnter Age OR DOB only if a child is being enrolled, if not, leave it blank.",null,null,"CHILD 9\nEnter Age OR DOB only if a child is being enrolled, if not, leave it blank.",null,null,"CHILD 10\nEnter Age OR DOB only if a child is being enrolled, if not, leave it blank."]
[null,"ZIP CODE*                           (5-Digits)","CLASS TYPE","FIRST NAME*","LAST NAME*","SEX*","AGE*\nEnter Age OR DOB","DOB*\n(MM/DD/YYYY)\nEnter Age OR DOB","MEDICARE \nSTATUS","EMPLOYMENT STATUS*","ANNUAL SALARY","OUT OF          AREA               OOA information will be ignored for Multi-site groups.","AGE\nEnter Age OR DOB","DOB\n(MM/DD/YYYY)\nEnter Age OR DOB","MEDICARE \nSTATUS","AGE\nEnter Age OR DOB","DOB\n(MM/DD/YYYY)\nEnter Age OR DOB","MEDICARE \nSTATUS","AGE\nEnter Age OR DOB","DOB\n(MM/DD/YYYY)\nEnter Age OR DOB","MEDICARE \nSTATUS","AGE\nEnter Age OR DOB","DOB\n(MM/DD/YYYY)\nEnter Age OR DOB","MEDICARE \nSTATUS","AGE\nEnter Age OR DOB","DOB\n(MM/DD/YYYY)\nEnter Age OR DOB","MEDICARE \nSTATUS","AGE\nEnter Age OR DOB","DOB\n(MM/DD/YYYY)\nEnter Age OR DOB","MEDICARE \nSTATUS","AGE\nEnter Age OR DOB","DOB\n(MM/DD/YYYY)\nEnter Age OR DOB","MEDICARE \nSTATUS","AGE\nEnter Age OR DOB","DOB\n(MM/DD/YYYY)\nEnter Age OR DOB","MEDICARE \nSTATUS","AGE\nEnter Age OR DOB","DOB\n(MM/DD/YYYY)\nEnter Age OR DOB","MEDICARE \nSTATUS","AGE\nEnter Age OR DOB","DOB\n(MM/DD/YYYY)\nEnter Age OR DOB","MEDICARE \nSTATUS","AGE\nEnter Age OR DOB","DOB\n(MM/DD/YYYY)\nEnter Age OR DOB","MEDICARE \nSTATUS"]

{"sheet":"Medical Waivers","index":6,"n_rows":1,"n_cols":5,"rows_kept":1,"cut":false,"hidden":true,"merged":[]}
["* Employee ID/SSN","* Relationship","* Last Name","* First Name","Medical Waiver Reason"]

{"sheet":"Tools","index":7,"n_rows":34,"n_cols":11,"rows_kept":34,"cut":false,"hidden":false,"merged":[[4,7,4,10],[5,8,8,10],[21,6,26,10],[29,8,31,10],[33,8,35,10]]}
["Version 2015.12.15.01"]
[]
[]
[]
[null,null,null,null,null,null,"Group Name:"]
[null,null,null,null,null,null,null,null,"(these fields are optional, here to help you track which group this spreadsheet belongs to)"]
[null,null,null,null,null,null,"Effective Date:"]
[]
[null,null,null,null,null,null,"Tax ID:"]
[]
[]
[]
[null,null,null,null,null,null,null,"Medical","Dental","Vision","Life"]
[null,null,null,null,null,null,"EE-only:"]
[null,null,null,null,null,null,"EE + Spouse:"]
{"$rows_left_out":20}
{"sheet":"Supp_Life_STD_LTD_Info","index":8,"n_rows":11,"n_cols":9,"rows_kept":11,"cut":false,"hidden":false,"merged":[[1,1,1,8],[2,1,3,1],[2,7,2,8],[2,5,2,6],[2,2,2,4]]}
[]
[null,"Supplemental Life / STD / LTD Information"]
[null,"EE Class","Supplemental Life Plan Information",null,null,"STD Information",null,"LTD Information"]
[null,null,"EE Plans","SP Amount Options","CH Amount Options","Plan","Buy-up available?","Plan","Buy-up available?"]
[null,1]
[null,2]
[null,3]
[null,4]
[null,5]
[null,6]
[null,7]

{"sheet":"Enrollment Form Explanations","index":9,"n_rows":115,"n_cols":3,"rows_kept":115,"cut":false,"hidden":false,"merged":[[93,0,93,1],[94,0,94,1],[97,0,97,1],[53,2,62,3],[0,0,0,1],[13,0,13,1],[90,0,90,1],[92,0,92,1]]}
["ENROLLMENT FORM EXPLANATIONS"]
["General Notes: "]
["Copying & Pasting","If you're going to copy and paste into the spreadsheet from another source, always paste values.  To do this, select the cell or range that you want to paste into, right-click, select \"Paste Special\", and then click on the \"Values\" radio button and click OK.  It's a best practice to do this and never do a normal paste, especially with date fields."]
["Dates","All dates must be between 1900 and 2020 and they will format automatically to the required format."]
["Dependents","Dependent information is required for every field marked by the red asterisk, as well as the Y/N indicators for each line of coverage the group is taking."]
["Drop-Down Menus vs. Typing","Data can be typed into each cell, granted that it matches the drop-down menu options for fields with drop-downs, which are case-sensitive.  Using Caps Lock and selecting from drop-downs where applicable are best practices."]
["Enrollment Forms","The spreadsheet does not take the place of Enrollment Forms (except for standalone specialty business on PRIME), Brokers must still submit them to the HealthPlan, and the Health Plan to Medical Underwriting (MUW).  There is no need to send them into Case Install (CI), if MUW has already been provided copies.  "]
["Info Boxes","Can be moved by dragging them with the curser, if they interfere with data being input."]
["Printing"," Select what you want printed, by holding down Shift and then using the Arrow keys.  Then go to File/Print/Selection (Under \"Print What\" on bottom left of the Print Dialogue box)/OK to PRINT."]
["Required Fields","All fields are required for every member, unless noted otherwise below."]
["Sample Spreadsheet Entry","A sample spreadsheet entry is pasted below and can be printed for reference."]
["\"Tools\" tab","Buttons to validate enrollment tab data for completeness and validity.  Also allows creation of MUGS and CAT census reports, and UeS exports for medical quotes."]
[]
["Sections A through G"]
["Employee ID/SSN","Enter all 9 digits, without dashes.  Every member must have ID/SSN field completed -- in this column, all dependents must use the subscriber's ID/SSN.  Please do not input the dependent's ID/SSN in this field.  Dependent ID numbers must match Employee/Participant’s ID and must be placed on the row directly below the Employee. "]
{"$rows_left_out":101}
{"sheet":"PlanSource MUW Export","index":10,"n_rows":6,"n_cols":78,"rows_kept":6,"cut":false,"hidden":false,"merged":[[3,68,5,68],[3,67,5,67],[3,60,5,60],[3,61,5,61],[3,70,5,70],[3,69,5,69],[3,62,5,62],[3,63,5,63],[3,64,5,64],[3,65,5,65],[3,66,5,66],[3,77,5,77],[3,71,5,71],[3,72,5,72],[3,73,5,73],[3,74,5,74],[3,76,5,76],[3,75,5,75],[3,59,5,59],[3,54,5,54],[3,55,5,55],[3,56,5,56],[3,57,5,57],[3,58,5,58]]}
[]
["PlanSource MUW Export Data",null,null,null,null,null,null,null,null,null,null,null,"PlanSource MUW Export Data",null,null,null,null,null,null,null,null,null,null,null,"PlanSource MUW Export Data                                                                                                                                                                                                                        PlanSource MUW Export Data                                                                                                                                                                                                                        PlanSource MUW Export Data                                                                                                                                                                                                                        PlanSource MUW Export Data"]
["* Required Fields for all Subscribers & Dependents ",null,null,null,null,null,null,null,null,null,null,null,"A. Employee (Subscriber) Information",null,null,null,null,null,null,"B. Employer Section",null,null,null,null,"C. Product Selection",null,null,null,null,null,null,null,null,null,null,null,null,null,null,null,null,null,null,null,null,null,null,null,"D. Other Medical Coverage",null,null,"E. Other",null,null,null,null,null,null,"Medical Underwriting",null,null,null,null,null,null,null,null,"Medical Underwriting"]
[null,null,null,null,null,null,null,null,"Underwriting ONLY !!!!!",null,null,null,null,null,null,null,null,null,null,null,null,null,null,null,null,null,null,null,null,null,null,"Life coverage amounts exceeding the guarantee issue will not be installed until proof of good health is provided and approved.   Completion of a Group Life and Disability Employee Enrollment form is required if Life exceeds guarantee issue amount.",null,null,null,null,null,null,null,null,null,null,null,null,null,null,null,null,null,null,null,null,null,null,"* Smoker","Covered by UnitedHealthcare in past 12 months? EE or SP only","Receiving Social Security Disability Insurance? EE Only","Medicare?","Medicare Type? EE and SP only","Medicare Eligibility Reason? EE and SP Only","eSignature Date","Y/N to any serious conditions","Condition 1 /Diagnosis\nTreatement/Meds\nPhysician's Name\nDates Treated\nPrognosis","Condition 2 /Diagnosis\nTreatement/Meds\nPhysician's Name\nDates Treated\nPrognosis","Condition 3 /Diagnosis\nTreatement/Meds\nPhysician's Name\nDates Treated\nPrognosis","Condition 4 /Diagnosis\nTreatement/Meds\nPhysician's Name\nDates Treated\nPrognosis","Condition 5 /Diagnosis\nTreatement/Meds\nPhysician's Name\nDates Treated\nPrognosis","Condition 6 /Diagnosis\nTreatement/Meds\nPhysician's Name\nDates Treated\nPrognosis","Condition 7 /Diagnosis\nTreatement/Meds\nPhysician's Name\nDates Treated\nPrognosis","Condition 8 /Diagnosis\nTreatement/Meds\nPhysician's Name\nDates Treated\nPrognosis","Condition 9 /Diagnosis\nTreatement/Meds\nPhysician's Name\nDates Treated\nPrognosis","Condition 10 /Diagnosis\nTreatement/Meds\nPhysician's Name\nDates Treated\nPrognosis","etc as needed","etc as needed","etc as needed","etc as needed","etc as needed","etc as needed"]
[null,null,null,null,null,null,null,null,"Height"]
["* Employee ID/SSN","* Dependent ID/SSN","* Relationship","* Last Name","* First Name","* Middle Initial","* Sex","* Date of Birth\n(MM/DD/YYYY)","Feet","Inches","Weight","Twin?","Street Address","City","State","ZIP","Home Phone","Work Phone (Optional)","Tier\n(Optional)\nTotals in Next Tab","Hire Date\n(MM/DD/YY)","Coverage Effective Date\n(MM/DD/YY)","COBRA Begin Date\n(MM/DD/YY)","COBRA End Date\n(MM/DD/YY)","Retire Date (51+ only)\n(MM/DD/YY)","Medical Coverage","Medical Plan\n(Multi-Choice Only)","PCP\n(HMO Only)","Dental Coverage","Dental Plan\n(Dual Option Only)","PCD\n(DHMO Only)","Vision Coverage","PRIME Life Coverage","PRIME Life Coverage Amount","Employee Annual Salary","PRIME Life Occupational Class","AD&D Amount","Dependent Life","Hours Worked","Supplemental Life / STD / LTD Occupational Class","EE Supplemental Life Plan","EE Supplemental Life Amount","Grandfathered EE Supp. Life Amount","SP Supplemental Life Amount","CH Supplemental Life Amount","STD (Salary) Coverage","STD\nBuyup?","LTD (Salary) Coverage","LTD\nBuyup?","* COB - Other Medical ","COB (begin date)\n(MM/DD/YY)","COB (end date)\n(MM/DD/YY)","On Prior Carrier? ","Exante Bank HSA Application","Health Transfer\n(Completed by C.I.)"]

{"sheet":"Counts_Relation_Tier_Ancillary","index":11,"n_rows":15,"n_cols":5,"rows_kept":15,"cut":false,"hidden":false,"merged":[]}
[]
[]
["RELATIONSHIP","COUNT",null,"TIER","COUNT"]
["EE = Employee",{"$f":"COUNTIF('NEW Enrollment Form'!$C$7:$C$300, \"EE\")","v":0},null,"EE = Employee",{"$f":"COUNTIF('NEW Enrollment Form'!$U$7:$U$3000, \"EE\")","v":0}]
["SP = Spouse",{"$f":"COUNTIF('NEW Enrollment Form'!$C$7:$C$300, \"SP\")","v":0},null,"ES = Employee+Spouse",{"$f":"COUNTIF('NEW Enrollment Form'!$U$7:$U$3000, \"ES\")","v":0}]
["CH = Child",{"$f":"COUNTIF('NEW Enrollment Form'!$C$7:$C$300, \"CH\")","v":0},null,"EC = Employee+Child",{"$f":"COUNTIF('NEW Enrollment Form'!$U$7:$U$3000, \"EC\")","v":0}]
["ST = Student",{"$f":"COUNTIF('NEW Enrollment Form'!$C$7:$C$300, \"ST\")","v":0},null,"F = Family",{"$f":"COUNTIF('NEW Enrollment Form'!$U$7:$U$3000, \"F\")","v":0}]
[null,null,null,"E+1 = Employee+1",{"$f":"COUNTIF('NEW Enrollment Form'!$U$7:$U$3000, \"E+1\")","v":0}]
["CB = Cobra",{"$f":"COUNTIF('NEW Enrollment Form'!$C$7:$C$300, \"CB\")","v":0}]
["DP = Domestic Partner",{"$f":"COUNTIF('NEW Enrollment Form'!$C$7:$C$300, \"DP\")","v":0}]
["HM = Mentally Handicapped",{"$f":"COUNTIF('NEW Enrollment Form'!$C$7:$C$300, \"HM\")","v":0}]
["HP = Physically Handicapped",{"$f":"COUNTIF('NEW Enrollment Form'!$C$7:$C$300, \"HP\")","v":0},null,"ANCILLARY","COUNT"]
["MC = Medicare",{"$f":"COUNTIF('NEW Enrollment Form'!$C$7:$C$300, \"MC\")","v":0},null,"Dental  (All Members)",{"$f":"COUNTIF('NEW Enrollment Form'!$AD$7:$AD$3000, \"Y\")","v":0}]
["RR = Retired ",{"$f":"COUNTIF('NEW Enrollment Form'!$C$7:$C$300, \"RR\")","v":0},null,"Vision  (All Members)",{"$f":"COUNTIF('NEW Enrollment Form'!$AG$7:$AG$3000, \"Y\")","v":0}]
["SS = Surviving Spouse",{"$f":"COUNTIF('NEW Enrollment Form'!$C$7:$C$300, \"SS\")","v":0},null,"Life  (EE Only)",{"$f":"COUNTIF('NEW Enrollment Form'!$AH$7:$AH$3000, \"Y\")","v":0}]
{"$rows_left_out":1}
{"sheet":"Utilization","index":12,"n_rows":4,"n_cols":6,"rows_kept":4,"cut":false,"hidden":true,"merged":[]}
[null,"SubscriberAdd","SubscriberDelete","DependentAdd","DependentDelete","MemberChange"]
["Outside",0,0,0,0,0]
["HP",0,0,0,0,0]
["SBCI",0,0,0,0,0]